BDBM50226883 CHEMBL282138
SMILES CCc1[nH]c(O)nc1C(=O)c1ccc(cc1)-n1ccnc1C(C)C
InChI Key InChIKey=AKYFKJZJHKXCSJ-UHFFFAOYSA-N
Data  1 IC50
  Tab Delimited (TSV)   2D SDfile   Computed 3D by Vconf -m prep SDfile
Find this compound or compounds like it in BindingDB:
Activity Spreadsheet -- Enzyme Inhibition Constant Data from BindingDB
Found 1 hit for monomerid = 50226883
TargetcAMP-specific 3',5'-cyclic phosphodiesterase 4A/4B/4C/4D(Homo sapiens (Human))
TBA
Curated by ChEMBL
LigandPNGBDBM50226883(CHEMBL282138)
Affinity DataIC50:  4.00E+4nM. Assay description: Inhibition of canine cardiac cAMP phosphodiesterase (cAMP-PDE)
In DepthDetails ArticlePubMed