BDBM50226972 CHEMBL606493
SMILES [H][C@@]1(OC([C@H](O)[C@@H]1O)n1cnc2C(N)N=CNc12)[C@H](CNP(O)(=O)OP(O)(=O)OP(O)(O)=O)SCCC(N)C(O)=O
InChI Key InChIKey=VWAGXKALHCKPTB-OXTAHZRQSA-N
Data  4 KI
  Tab Delimited (TSV)   2D SDfile   Computed 3D by Vconf -m prep SDfile
Find this compound or compounds like it in BindingDB:
Activity Spreadsheet -- Enzyme Inhibition Constant Data from BindingDB
Found 4 hits for monomerid = 50226972
TargetS-adenosylmethionine synthase isoform type-1/type-2(Rattus norvegicus)
TBA
Curated by ChEMBL
LigandPNGBDBM50226972(CHEMBL606493)
Affinity DataKi:  270nM. Assay description: Inhibition constants of MT Forms of rat Novikoff Ascitic Hepatomae using ATP as the variable substrate; Inhibition is competitive type
In DepthDetails ArticlePubMed
TargetS-adenosylmethionine synthase isoform type-1/type-2(Rattus norvegicus)
TBA
Curated by ChEMBL
LigandPNGBDBM50226972(CHEMBL606493)
Affinity DataKi:  360nM. Assay description: Inhibition constants of M-2 Forms of rat methionine adenosyltransferase using ATP as the variable substrate; Inhibition is competitive type
In DepthDetails ArticlePubMed
TargetS-adenosylmethionine synthase isoform type-1/type-2(Rattus norvegicus)
TBA
Curated by ChEMBL
LigandPNGBDBM50226972(CHEMBL606493)
Affinity DataKi:  2.30E+3nM. Assay description: Inhibition constants of MT Forms of rat Novikoff Ascitic Hepatomae using Methionine as the variable substrate; Inhibition is non competitive type
In DepthDetails ArticlePubMed
TargetS-adenosylmethionine synthase isoform type-1/type-2(Rattus norvegicus)
TBA
Curated by ChEMBL
LigandPNGBDBM50226972(CHEMBL606493)
Affinity DataKi:  3.00E+3nM. Assay description: Inhibition constants of M-2 Forms of rat methionine adenosyltransferase using Methionine as the variable substrate; Inhibition is non competitive typ...
In DepthDetails ArticlePubMed