BDBM50227013 2-hydroxy-N,N-dimethyl-3-{4-[(R)-1-(4-methyl-3,4-dihydro-2H-benzo[1,4]oxazin-7-yl)-propylamino]-1,1-dioxo-1H-1lambda6-[1,2,5]thiadiazol-3-ylamino}-benzamide::CHEMBL252289
SMILES CC[C@@H](NC1=NS(=O)(=O)NC1=Nc1cccc(C(=O)N(C)C)c1O)c1ccc2N(C)CCOc2c1
InChI Key InChIKey=MTPPDQAZXQWYES-MRXNPFEDSA-N
Data  2 KI
  Tab Delimited (TSV)   2D SDfile   Computed 3D by Vconf -m prep SDfile
Find this compound or compounds like it in BindingDB:
Activity Spreadsheet -- Enzyme Inhibition Constant Data from BindingDB
Found 2 hits for monomerid = 50227013
TargetC-X-C chemokine receptor type 2(Homo sapiens (Human))
Schering-Plough Research Institute
Curated by ChEMBL
LigandPNGBDBM50227013(2-hydroxy-N,N-dimethyl-3-{4-[(R)-1-(4-methyl-3,4-d...)
Affinity DataKi:  9nM. Assay description: Binding affinity to CXCR2
In DepthDetails ArticlePubMed
TargetC-X-C chemokine receptor type 1(Homo sapiens (Human))
Schering-Plough Research Institute
Curated by ChEMBL
LigandPNGBDBM50227013(2-hydroxy-N,N-dimethyl-3-{4-[(R)-1-(4-methyl-3,4-d...)
Affinity DataKi:  2.80E+3nM. Assay description: Binding affinity to CXCR1
In DepthDetails ArticlePubMed