BDBM50227034 CHEMBL353716
SMILES CCCCCOc1cccc(\C=C\C(=O)Nc2cccc3OCC(Oc23)c2nnn[nH]2)c1
InChI Key InChIKey=FLVULROWBMBEMN-VAWYXSNFSA-N
Data  1 IC50
  Tab Delimited (TSV)   2D SDfile   Computed 3D by Vconf -m prep SDfile
Find this compound or compounds like it in BindingDB:
Activity Spreadsheet -- Enzyme Inhibition Constant Data from BindingDB
Found 1 hit for monomerid = 50227034
TargetCysteinyl leukotriene receptor 1/2(Homo sapiens (Human))
Ono Pharmaceutical
Curated by ChEMBL
LigandPNGBDBM50227034(CHEMBL353716)
Affinity DataIC50:  150nM. Assay description: Inhibition of LTC4 induced smooth muscle contraction of guinea pig ileum
In DepthDetails ArticlePubMed