BDBM50227069 CHEMBL170964
SMILES CCCCCOc1ccccc1\C=C\C(=O)Nc1cccc2OCC(Oc12)c1nnn[nH]1
InChI Key InChIKey=WVDLRLOBRVVPMZ-OUKQBFOZSA-N
Data  1 IC50
  Tab Delimited (TSV)   2D SDfile   Computed 3D by Vconf -m prep SDfile
Find this compound or compounds like it in BindingDB:
Activity Spreadsheet -- Enzyme Inhibition Constant Data from BindingDB
Found 1 hit for monomerid = 50227069
TargetCysteinyl leukotriene receptor 1/2(Homo sapiens (Human))
Ono Pharmaceutical
Curated by ChEMBL
LigandPNGBDBM50227069(CHEMBL170964)
Affinity DataIC50:  2.30E+3nM. Assay description: Inhibition of LTC4 induced smooth muscle contraction of guinea pig ileum
In DepthDetails ArticlePubMed