BDBM50227141 CHEMBL174483
SMILES CCCCCc1ccc(\C=C\C(=O)Nc2cccc3c2oc(cc3=O)C(O)=O)cc1
InChI Key InChIKey=HUNHHUAGWDAVDL-BUHFOSPRSA-N
Data  2 IC50
  Tab Delimited (TSV)   2D SDfile   Computed 3D by Vconf -m prep SDfile
Find this compound or compounds like it in BindingDB:
Activity Spreadsheet -- Enzyme Inhibition Constant Data from BindingDB
Found 2 hits for monomerid = 50227141
TargetCysteinyl leukotriene receptor 1(GUINEA PIG)
Goethe-University Frankfurt
Curated by ChEMBL
LigandPNGBDBM50227141(CHEMBL174483)
Affinity DataIC50:  240nM. Assay description: Displacement of [3H]ICI from cysteinyl leukotriene receptor 1 in Hartley guinea pig lung membrane after 30 mins by liquid scintillation counting meth...
In DepthDetails ArticlePubMed
TargetCysteinyl leukotriene receptor 1/2(Homo sapiens (Human))
Ono Pharmaceutical
Curated by ChEMBL
LigandPNGBDBM50227141(CHEMBL174483)
Affinity DataIC50:  240nM. Assay description: Inhibition of LTC4 induced smooth muscle contraction of guinea pig ileum
In DepthDetails ArticlePubMed