BDBM50227161 2-(4-(3-(3-benzyl-8-(trifluoromethyl)quinolin-4-yl)benzylamino)naphthalen-1-yl)acetic acid::CHEMBL404469
SMILES OC(=O)Cc1ccc(NCc2cccc(c2)-c2c(Cc3ccccc3)cnc3c(cccc23)C(F)(F)F)c2ccccc12
InChI Key InChIKey=UUIQBDLORYXQJP-UHFFFAOYSA-N
Data  2 IC50
  Tab Delimited (TSV)   2D SDfile   Computed 3D by Vconf -m prep SDfile
Find this compound or compounds like it in BindingDB:
Activity Spreadsheet -- Enzyme Inhibition Constant Data from BindingDB
Found 2 hits for monomerid = 50227161
TargetOxysterols receptor LXR-alpha(Homo sapiens (Human))
Wyeth Pharmaceuticals
Curated by ChEMBL
LigandPNGBDBM50227161(2-(4-(3-(3-benzyl-8-(trifluoromethyl)quinolin-4-yl...)
Affinity DataIC50:  21nM. Assay description: Binding affinity at human LXRalpha
In DepthDetails ArticlePubMed
TargetOxysterols receptor LXR-beta(Homo sapiens (Human))
Wyeth Pharmaceuticals
Curated by ChEMBL
LigandPNGBDBM50227161(2-(4-(3-(3-benzyl-8-(trifluoromethyl)quinolin-4-yl...)
Affinity DataIC50:  2nM. Assay description: Binding affinity at human LXRbeta
In DepthDetails ArticlePubMed