BDBM50227165 (S)-N-(1-(4-(2,4-dimethoxybenzyl)-5-benzyl-4H-1,2,4-triazol-3-yl)-2-(1H-indol-3-yl)ethyl)-2-amino-2-methylpropanamide::CHEMBL402811
SMILES COc1ccc(Cn2c(Cc3ccccc3)nnc2[C@H](Cc2c[nH]c3ccccc23)NC(=O)C(C)(C)N)c(OC)c1
InChI Key InChIKey=PWQYLDSMPYWAPW-MHZLTWQESA-N
Data  1 IC50
  Tab Delimited (TSV)   2D SDfile   Computed 3D by Vconf -m prep SDfile
Find this compound or compounds like it in BindingDB:
Activity Spreadsheet -- Enzyme Inhibition Constant Data from BindingDB
Found 1 hit for monomerid = 50227165
TargetGrowth hormone secretagogue receptor type 1(Homo sapiens (Human))
University Of Montpellier
Curated by ChEMBL
LigandPNGBDBM50227165((S)-N-(1-(4-(2,4-dimethoxybenzyl)-5-benzyl-4H-1,2,...)
Affinity DataIC50: >1.00E+3nM. Assay description: Displacement of [125I]His9-ghrelin from human GHSR1a receptor expressed in LLC PK1 cells
In DepthDetails ArticlePubMed