BDBM50227848 (3S,4R)-N-hydroxy-4-(4-((2-methylquinolin-4-yl)methoxy)benzamido)piperidine-3-carboxamide::CHEMBL403684
SMILES Cc1cc(COc2ccc(cc2)C(=O)N[C@@H]2CCNC[C@@H]2C(=O)NO)c2ccccc2n1
InChI Key InChIKey=FAAUHWULQKLSFX-RBBKRZOGSA-N
Data  1 IC50
  Tab Delimited (TSV)   2D SDfile   Computed 3D by Vconf -m prep SDfile
Find this compound or compounds like it in BindingDB:
Activity Spreadsheet -- Enzyme Inhibition Constant Data from BindingDB
Found 1 hit for monomerid = 50227848
TargetDisintegrin and metalloproteinase domain-containing protein 17(Sus scrofa (pig))
Bristol-Myers Squibb
Curated by ChEMBL
LigandPNGBDBM50227848((3S,4R)-N-hydroxy-4-(4-((2-methylquinolin-4-yl)met...)
Affinity DataIC50:  24nM. Assay description: Inhibition of pig TACE
In DepthDetails ArticlePubMed