BDBM50227855 CHEMBL254307::N-(2-(hydroxycarbamoyl)cyclobutyl)-4-((2-methylquinolin-4-yl)methoxy)benzamide
SMILES Cc1cc(COc2ccc(cc2)C(=O)NC2CCC2C(=O)NO)c2ccccc2n1
InChI Key InChIKey=GCUJRHBDOOTROU-UHFFFAOYSA-N
Data  1 IC50
  Tab Delimited (TSV)   2D SDfile   Computed 3D by Vconf -m prep SDfile
Find this compound or compounds like it in BindingDB:
Activity Spreadsheet -- Enzyme Inhibition Constant Data from BindingDB
Found 1 hit for monomerid = 50227855
TargetDisintegrin and metalloproteinase domain-containing protein 17(Sus scrofa (pig))
Bristol-Myers Squibb
Curated by ChEMBL
LigandPNGBDBM50227855(CHEMBL254307 | N-(2-(hydroxycarbamoyl)cyclobutyl)-...)
Affinity DataIC50:  1nM. Assay description: Inhibition of pig TACE
In DepthDetails ArticlePubMed