BDBM50227885 CHEMBL264721
SMILES COc1cc2nc(nc(N)c2cc1OC)N1CCN(CC1)C(\S)=N\c1ccccc1
InChI Key InChIKey=GMHALCSWFDUNRX-UHFFFAOYSA-N
Data  1 IC50
  Tab Delimited (TSV)   2D SDfile   Computed 3D by Vconf -m prep SDfile
Find this compound or compounds like it in BindingDB:
Activity Spreadsheet -- Enzyme Inhibition Constant Data from BindingDB
Found 1 hit for monomerid = 50227885
TargetAlpha-1A/Alpha-1B/Alpha-1D adrenergic receptor(Rattus norvegicus (rat))
National Institute On Aging/Grc
Curated by ChEMBL
LigandPNGBDBM50227885(CHEMBL264721)
Affinity DataIC50:  0.00692nM. Assay description: Binding affinity at Alpha-1 adrenergic receptor sites on rat cerebral cortical membranes by [3H]prazosin displacement.
In DepthDetails ArticlePubMed