BDBM50227886 CHEMBL415103
SMILES COc1cc2nc(nc(N)c2cc1OC)N1CCN(CC1)C(=O)C1OC1c1ccccc1
InChI Key InChIKey=HCCHLOLDFKYQCN-UHFFFAOYSA-N
Data  1 IC50
  Tab Delimited (TSV)   2D SDfile   Computed 3D by Vconf -m prep SDfile
Find this compound or compounds like it in BindingDB:
Activity Spreadsheet -- Enzyme Inhibition Constant Data from BindingDB
Found 1 hit for monomerid = 50227886
TargetAlpha-1A/Alpha-1B/Alpha-1D adrenergic receptor(Rattus norvegicus (rat))
National Institute On Aging/Grc
Curated by ChEMBL
LigandPNGBDBM50227886(CHEMBL415103)
Affinity DataIC50:  13nM. Assay description: Compound is evaluated for its ability to compete with [3H]prazosin for binding to Alpha-1 adrenergic receptor sites on rat cerebral cortical membrane...
In DepthDetails ArticlePubMed