BDBM50227909 CHEMBL307505
SMILES CC(C)(C)CCN(Cc1cccs1)C(=O)Nc1c(Cl)cc(Cl)cc1Cl
InChI Key InChIKey=BFDOHKWINMOKDM-UHFFFAOYSA-N
Data  2 IC50
  Tab Delimited (TSV)   2D SDfile   Computed 3D by Vconf -m prep SDfile
Find this compound or compounds like it in BindingDB:
Activity Spreadsheet -- Enzyme Inhibition Constant Data from BindingDB
Found 2 hits for monomerid = 50227909
TargetSterol O-acyltransferase 1(Rattus norvegicus)
American Cyanamid
Curated by ChEMBL
LigandPNGBDBM50227909(CHEMBL307505)
Affinity DataIC50:  976nM. Assay description: In vitro inhibitory concentration against acyl coenzyme A:cholesterol acyltransferase derived from rat adrenals
In DepthDetails ArticlePubMed
TargetSterol O-acyltransferase 1(Homo sapiens (Human))
American Cyanamid
Curated by ChEMBL
LigandPNGBDBM50227909(CHEMBL307505)
Affinity DataIC50:  2.62E+3nM. Assay description: In vitro inhibitory concentration against acyl coenzyme A:cholesterol acyltransferase derived from smooth muscle cells from thoracic aorta of monkeys
In DepthDetails ArticlePubMed