BDBM50227920 CHEMBL73982
SMILES CCCCN(CCCC)C(=O)Nc1ccc(CCCC)cc1
InChI Key InChIKey=ZSQJFAFRRMBAPQ-UHFFFAOYSA-N
Data  1 IC50
  Tab Delimited (TSV)   2D SDfile   Computed 3D by Vconf -m prep SDfile
Find this compound or compounds like it in BindingDB:
Activity Spreadsheet -- Enzyme Inhibition Constant Data from BindingDB
Found 1 hit for monomerid = 50227920
TargetSterol O-acyltransferase 1(Rattus norvegicus)
American Cyanamid
Curated by ChEMBL
LigandPNGBDBM50227920(CHEMBL73982)
Affinity DataIC50:  9.19E+3nM. Assay description: In vitro inhibitory concentration against acyl coenzyme A:cholesterol acyltransferase derived from rat adrenals
In DepthDetails ArticlePubMed