BDBM50227936 CHEMBL73918
SMILES CCCCCCCCN(CCCCCCCC)C(=O)Nc1ccc(C)cc1C
InChI Key InChIKey=VEBHMHPYDVREKI-UHFFFAOYSA-N
Data  2 IC50
  Tab Delimited (TSV)   2D SDfile   Computed 3D by Vconf -m prep SDfile
Find this compound or compounds like it in BindingDB:
Activity Spreadsheet -- Enzyme Inhibition Constant Data from BindingDB
Found 2 hits for monomerid = 50227936
TargetSterol O-acyltransferase 1(Rattus norvegicus)
American Cyanamid
Curated by ChEMBL
LigandPNGBDBM50227936(CHEMBL73918)
Affinity DataIC50:  1.41E+3nM. Assay description: In vitro inhibitory concentration against Acyl coenzyme A:cholesterol acyltransferase derived from smooth muscle cells from thoracic aorta of monkeys
In DepthDetails ArticlePubMed
TargetSterol O-acyltransferase 1(Homo sapiens (Human))
American Cyanamid
Curated by ChEMBL
LigandPNGBDBM50227936(CHEMBL73918)
Affinity DataIC50:  1.31E+3nM. Assay description: In vitro inhibitory concentration against Acyl coenzyme A:cholesterol acyltransferase derived from smooth muscle cells from thoracic aorta of monkeys
In DepthDetails ArticlePubMed