BDBM50228506 CHEMBL97656
SMILES CC(CCc1nnn[nH]1)Cc1ccc(OCc2ccc3ccccc3n2)cc1
InChI Key InChIKey=POSUQRXFCPPYHP-UHFFFAOYSA-N
Data  1 KI
  Tab Delimited (TSV)   2D SDfile   Computed 3D by Vconf -m prep SDfile
Find this compound or compounds like it in BindingDB:
Activity Spreadsheet -- Enzyme Inhibition Constant Data from BindingDB
Found 1 hit for monomerid = 50228506
TargetCysteinyl leukotriene receptor 1/2(Homo sapiens (Human))
Rorer Central Research
Curated by ChEMBL
LigandPNGBDBM50228506(CHEMBL97656)
Affinity DataKi:  12nM. Assay description: In vitro binding affinity against cysteinyl leukotriene D4 receptor from guinea pig lung membrane
In DepthDetails ArticlePubMed