BDBM50228555 CHEMBL95985
SMILES COCCc1ccc(OCC(O)CN2CCN(CC2)C(=O)c2ccc(NS(C)(=O)=O)cc2)cc1
InChI Key InChIKey=KGHMBTJPFPFRKU-UHFFFAOYSA-N
Data  1 IC50
  Tab Delimited (TSV)   2D SDfile   Computed 3D by Vconf -m prep SDfile
Find this compound or compounds like it in BindingDB:
Activity Spreadsheet -- Enzyme Inhibition Constant Data from BindingDB
Found 1 hit for monomerid = 50228555
TargetBeta-1/Beta-2/Beta-3 adrenergic receptor(Homo sapiens (Human))
Berlex Laboratories
Curated by ChEMBL
LigandPNGBDBM50228555(CHEMBL95985)
Affinity DataIC50:  3.60E+5nM. Assay description: Tested for Beta adrenergic receptor binding inhibition from canine ventricular tissue, using [3H]dihydroalprenolol as the radioligand in anesthetized...
In DepthDetails ArticlePubMed