BDBM50228583 CHEMBL1203012
SMILES Cl.CS(=O)(=O)N1CCC[C@H]1C#CCN1CCCC1
InChI Key InChIKey=ZEOGUDQDKKCYCL-UTONKHPSSA-N
Data  5 KI
  Tab Delimited (TSV)   2D SDfile   Computed 3D by Vconf -m prep SDfile
Find this compound or compounds like it in BindingDB:
Activity Spreadsheet -- Enzyme Inhibition Constant Data from BindingDB
Found 5 hits for monomerid = 50228583
TargetMuscarinic acetylcholine receptor M1/M2/M3/M4/M5(RAT)
American Cyanamid
Curated by ChEMBL
LigandPNGBDBM50228583(CHEMBL1203012)
Affinity DataKi:  3.02E+3nM. Assay description: Binding activity against Muscarinic acetylcholine receptor in rat cortex, using [3H]QNB as a radioligand.
In DepthDetails ArticlePubMed
TargetMuscarinic acetylcholine receptor M1/M2/M3/M4/M5(RAT)
American Cyanamid
Curated by ChEMBL
LigandPNGBDBM50228583(CHEMBL1203012)
Affinity DataKi:  3.92E+3nM. Assay description: Binding activity to the muscarinic acetylcholine receptor in rat cortex, assayed using [3H]CD as a radioligand.
In DepthDetails ArticlePubMed
TargetMuscarinic acetylcholine receptor M1/M2/M3/M4/M5(RAT)
American Cyanamid
Curated by ChEMBL
LigandPNGBDBM50228583(CHEMBL1203012)
Affinity DataKi:  6.05E+3nM. Assay description: Binding activity to the muscarinic acetylcholine receptor in rat cortex, assayed using [3H]PZ as a radioligand.
In DepthDetails ArticlePubMed
TargetMuscarinic acetylcholine receptor M1/M2/M3/M4/M5(RAT)
American Cyanamid
Curated by ChEMBL
LigandPNGBDBM50228583(CHEMBL1203012)
Affinity DataKi:  9.19E+3nM. Assay description: Binding activity to muscarinic acetylcholine receptor in rat heart, assayed using [3H]-QNB as a radioligand.
In DepthDetails ArticlePubMed
TargetMuscarinic acetylcholine receptor M1/M2/M3/M4/M5(RAT)
American Cyanamid
Curated by ChEMBL
LigandPNGBDBM50228583(CHEMBL1203012)
Affinity DataKi:  1.51E+4nM. Assay description: Competitive inhibition of recombinant TAK1-TAB1 assessed as [33P]gamma-ATP incorporation into substrate histone H1 peptide by filter plate assay
In DepthDetails ArticlePubMed