BDBM50228771 CHEMBL312602
SMILES [H][C@@]1(CNC(=O)c2c(O)c(Cl)cc(Cl)c2OC)CCCN1CCF
InChI Key InChIKey=SUMSSRZHRHBCGI-VIFPVBQESA-N
Data  1 KI
  Tab Delimited (TSV)   2D SDfile   Computed 3D by Vconf -m prep SDfile
Find this compound or compounds like it in BindingDB:
Activity Spreadsheet -- Enzyme Inhibition Constant Data from BindingDB
Found 1 hit for monomerid = 50228771
TargetD(1A)/D(1B)/D(2)/D(3)/D(4) dopamine receptor(Homo sapiens (Human))
Washington University
Curated by ChEMBL
LigandPNGBDBM50228771(CHEMBL312602)
Affinity DataKi:  159nM. Assay description: In vitro inhibition of [3H]spiperone binding to Dopamine receptor D2 in Macaca nemestrina striatal membranes
In DepthDetails ArticlePubMed