BDBM50228972 CHEMBL322352
SMILES OC(=O)C1Cc2c(CN1C(=O)COc1ccccc1)ncn2Cc1ccccc1
InChI Key InChIKey=HODQIIYWLUQEAE-UHFFFAOYSA-N
Data  1 IC50
  Tab Delimited (TSV)   2D SDfile   Computed 3D by Vconf -m prep SDfile
Find this compound or compounds like it in BindingDB:
Activity Spreadsheet -- Enzyme Inhibition Constant Data from BindingDB
Found 1 hit for monomerid = 50228972
LigandPNGBDBM50228972(CHEMBL322352)
Affinity DataIC50:  4.00E+3nM. Assay description: Binding affinity against Angiotensin II receptor, from rat adrenal gland
In DepthDetails ArticlePubMed