BDBM50229006 CHEMBL322335
SMILES OC(=O)C1Cc2c(CN1C(=O)CC(c1ccccc1)c1ccccc1)ncn2Cc1ccccc1
InChI Key InChIKey=OEUMBQRMVCGPQG-UHFFFAOYSA-N
Data  1 IC50
  Tab Delimited (TSV)   2D SDfile   Computed 3D by Vconf -m prep SDfile
Find this compound or compounds like it in BindingDB:
Activity Spreadsheet -- Enzyme Inhibition Constant Data from BindingDB
Found 1 hit for monomerid = 50229006
LigandPNGBDBM50229006(CHEMBL322335)
Affinity DataIC50:  1.20E+3nM. Assay description: Binding affinity against Angiotensin II receptor, from rat adrenal gland
In DepthDetails ArticlePubMed