BDBM50229117 CHEMBL399181::N-((S)-1-oxo-1-((S)-5-phenyl-1-(phenylsulfonyl)pent-1-en-3-ylamino)-3-p-tolylpropan-2-yl)-4-(trifluoromethyl)benzamide
SMILES Cc1ccc(C[C@H](NC(=O)c2ccc(cc2)C(F)(F)F)C(=O)N[C@@H](CCc2ccccc2)\C=C\S(=O)(=O)c2ccccc2)cc1
InChI Key InChIKey=OTVOARDTFYXJFY-WDWXGRBNSA-N
Data  1 KI
  Tab Delimited (TSV)   2D SDfile   Computed 3D by Vconf -m prep SDfile
Find this compound or compounds like it in BindingDB:
Activity Spreadsheet -- Enzyme Inhibition Constant Data from BindingDB
Found 1 hit for monomerid = 50229117
TargetCruzipain(Trypanosoma cruzi)
University Of California
Curated by ChEMBL
LigandPNGBDBM50229117(CHEMBL399181 | N-((S)-1-oxo-1-((S)-5-phenyl-1-(phe...)
Affinity DataKi:  45nM. Assay description: Inhibition of Trypanosoma cruzi cruzain
In DepthDetails ArticlePubMed