BDBM50229176 CHEMBL161775
SMILES [H][C@]12CCN(C[C@@]1([H])C[C@]1([H])N(CCc3ccccc13)C2)S(C)(=O)=O
InChI Key InChIKey=MOXFACZZKFTOIR-INMHGKMJSA-N
Data  2 KI
  Tab Delimited (TSV)   2D SDfile   Computed 3D by Vconf -m prep SDfile
Find this compound or compounds like it in BindingDB:
Activity Spreadsheet -- Enzyme Inhibition Constant Data from BindingDB
Found 2 hits for monomerid = 50229176
LigandPNGBDBM50229176(CHEMBL161775)
Affinity DataKi:  29nM. Assay description: Binding affinity to alpha-2 adrenergic receptor determined by measurement of [3H]yohimbine displacement from rat cortical membrane
In DepthDetails ArticlePubMed
TargetAlpha-1A/Alpha-1B/Alpha-1D adrenergic receptor(Rattus norvegicus (rat))
Syntex Research
Curated by ChEMBL
LigandPNGBDBM50229176(CHEMBL161775)
Affinity DataKi:  1.59E+3nM. Assay description: Binding affinity to alpha-1 adrenergic receptor determined by measurement of [3H]prazosin displacement from rat cortical membrane
In DepthDetails ArticlePubMed