BDBM50229361 CHEMBL77886
SMILES CN(C)CC#CCN1CCNC1=O
InChI Key InChIKey=ZIQJEFUPGSFPIY-UHFFFAOYSA-N
Data  2 KI
  Tab Delimited (TSV)   2D SDfile   Computed 3D by Vconf -m prep SDfile
Find this compound or compounds like it in BindingDB:
Activity Spreadsheet -- Enzyme Inhibition Constant Data from BindingDB
Found 2 hits for monomerid = 50229361
LigandPNGBDBM50229361(CHEMBL77886)
Affinity DataKi:  43nM. Assay description: Binding affinity to muscarinic acetylcholine receptor was determined in presence of [3H]OXO-M radioligand (in vitro)
In DepthDetails ArticlePubMed
LigandPNGBDBM50229361(CHEMBL77886)
Affinity DataKi: >1.00E+4nM. Assay description: Binding affinity to muscarinic acetylcholine receptor was determined in presence of [3H]QNB radioligand (in vitro)
In DepthDetails ArticlePubMed