BDBM50229427 CHEMBL401143::Tyr-(S)-spiro-Aba-Gly-Phe-NH2
SMILES N[C@@H](Cc1ccc(O)cc1)C(=O)N1CCC[C@@]11Cc2ccccc2CN(CC(=O)N[C@@H](Cc2ccccc2)C(N)=O)C1=O
InChI Key InChIKey=XXSVWIUHNDWFND-DRVYDUGISA-N
Data  2 KI
  Tab Delimited (TSV)   2D SDfile   Computed 3D by Vconf -m prep SDfile
Find this compound or compounds like it in BindingDB:
Activity Spreadsheet -- Enzyme Inhibition Constant Data from BindingDB
Found 2 hits for monomerid = 50229427
TargetDelta-type opioid receptor(Rattus norvegicus (rat))
Biological Research Center Of The Hungarian Academy Of Sciences
Curated by ChEMBL
LigandPNGBDBM50229427(CHEMBL401143 | Tyr-(S)-spiro-Aba-Gly-Phe-NH2)
Affinity DataKi:  2.31nM. Assay description: Displacement of [3H]deltorphin 2 from delta opioid receptor in Wistar rat brain after 45 mins
In DepthDetails ArticlePubMed
TargetMu-type opioid receptor(Rattus norvegicus (rat))
Biological Research Center Of The Hungarian Academy Of Sciences
Curated by ChEMBL
LigandPNGBDBM50229427(CHEMBL401143 | Tyr-(S)-spiro-Aba-Gly-Phe-NH2)
Affinity DataKi:  8.73nM. Assay description: Displacement of [3H]DAMGO from mu opioid receptor in Wistar rat brain after 45 mins
In DepthDetails ArticlePubMed