BDBM50229449 CHEMBL310619
SMILES CCCCc1nc(Cl)c(\C=N\NC2=NCCN2)n1Cc1ccc(cc1)-c1ccccc1-c1nn[nH]n1
InChI Key InChIKey=AAAXWRLNADMLIF-WKULSOCRSA-N
Data  1 IC50
  Tab Delimited (TSV)   2D SDfile   Computed 3D by Vconf -m prep SDfile
Find this compound or compounds like it in BindingDB:
Activity Spreadsheet -- Enzyme Inhibition Constant Data from BindingDB
Found 1 hit for monomerid = 50229449
LigandPNGBDBM50229449(CHEMBL310619)
Affinity DataIC50:  290nM. Assay description: Inhibition of radioligand [3H]angiotensin II binding to angiotensin II receptor of rat adrenal cortical membrane
In DepthDetails ArticlePubMed