BDBM50229465 CHEMBL315594
SMILES CCCCc1nc(I)c(CO)n1Cc1ccc(cc1)-c1ccccc1C(O)=O
InChI Key InChIKey=ZDYQKPQVQADART-UHFFFAOYSA-N
Data  1 IC50
  Tab Delimited (TSV)   2D SDfile   Computed 3D by Vconf -m prep SDfile
Find this compound or compounds like it in BindingDB:
Activity Spreadsheet -- Enzyme Inhibition Constant Data from BindingDB
Found 1 hit for monomerid = 50229465
LigandPNGBDBM50229465(CHEMBL315594)
Affinity DataIC50:  61nM. Assay description: Inhibition of radioligand [3H]angiotensin II binding to angiotensin II receptor of rat adrenal cortical membrane
In DepthDetails ArticlePubMed