BDBM50229482 CHEMBL82445
SMILES CCCCc1nc(Cl)c(C(O)c2ccccc2)n1Cc1ccc(cc1)-c1ccccc1-c1nn[nH]n1
InChI Key InChIKey=JKKAPDULUACEAE-UHFFFAOYSA-N
Data  1 IC50
  Tab Delimited (TSV)   2D SDfile   Computed 3D by Vconf -m prep SDfile
Find this compound or compounds like it in BindingDB:
Activity Spreadsheet -- Enzyme Inhibition Constant Data from BindingDB
Found 1 hit for monomerid = 50229482
LigandPNGBDBM50229482(CHEMBL82445)
Affinity DataIC50:  410nM. Assay description: Inhibition of radioligand [3H]angiotensin II binding to angiotensin II receptor of rat adrenal cortical membrane
In DepthDetails ArticlePubMed