BDBM50229530 CHEMBL329434
SMILES COC(=O)C12CCN(C1)CCC2
InChI Key InChIKey=VKAXQCQHGFANDY-UHFFFAOYSA-N
Data  2 IC50
  Tab Delimited (TSV)   2D SDfile   Computed 3D by Vconf -m prep SDfile
Find this compound or compounds like it in BindingDB:
Activity Spreadsheet -- Enzyme Inhibition Constant Data from BindingDB
Found 2 hits for monomerid = 50229530
TargetMuscarinic acetylcholine receptor M1/M2/M3/M4/M5(RAT)
Smithkline Beecham Pharmaceuticals
Curated by ChEMBL
LigandPNGBDBM50229530(CHEMBL329434)
Affinity DataIC50:  19nM. Assay description: The compound was tested in vitro for central muscarinic acetylcholine receptor affinity to displace [3H]oxotremorine-M from rat cerebral cortex; Valu...
In DepthDetails ArticlePubMed
TargetMuscarinic acetylcholine receptor M1/M2/M3/M4/M5(RAT)
Smithkline Beecham Pharmaceuticals
Curated by ChEMBL
LigandPNGBDBM50229530(CHEMBL329434)
Affinity DataIC50:  6.40E+3nM. Assay description: The compound was tested in vitro for central muscarinic acetylcholine receptor affinity to displace [3H]quinuclidinyl benzilate from rat cerebral cor...
In DepthDetails ArticlePubMed