BDBM50229566 CHEMBL98268
SMILES Cc1cc2[nH]c3nc(O)nc3cc2c(C)c1Cl
InChI Key InChIKey=GYPSSORWUVEFFW-UHFFFAOYSA-N
Data  1 IC50
  Tab Delimited (TSV)   2D SDfile   Computed 3D by Vconf -m prep SDfile
Find this compound or compounds like it in BindingDB:
Activity Spreadsheet -- Enzyme Inhibition Constant Data from BindingDB
Found 1 hit for monomerid = 50229566
TargetcGMP-inhibited 3',5'-cyclic phosphodiesterase 3A/3B(Homo sapiens (Human))
Bristol-Myers Squibb Pharmaceutical Research Institute
Curated by ChEMBL
LigandPNGBDBM50229566(CHEMBL98268)
Affinity DataIC50:  20nM. Assay description: Inhibition of hydrolysis of c-AMP phosphodiesterase in human platelets
In DepthDetails ArticlePubMed