BDBM50229570 CHEMBL98208
SMILES Cc1cc2[nH]c3nc(O)nc3cc2c(C)c1Br
InChI Key InChIKey=YEBXOZQMALFMCP-UHFFFAOYSA-N
Data  1 IC50
  Tab Delimited (TSV)   2D SDfile   Computed 3D by Vconf -m prep SDfile
Find this compound or compounds like it in BindingDB:
Activity Spreadsheet -- Enzyme Inhibition Constant Data from BindingDB
Found 1 hit for monomerid = 50229570
TargetcGMP-inhibited 3',5'-cyclic phosphodiesterase 3A/3B(Homo sapiens (Human))
Bristol-Myers Squibb Pharmaceutical Research Institute
Curated by ChEMBL
LigandPNGBDBM50229570(CHEMBL98208)
Affinity DataIC50:  5nM. Assay description: Inhibition of hydrolysis of c-AMP phosphodiesterase in human platelets
In DepthDetails ArticlePubMed