BDBM50229715 CHEMBL4070615
SMILES [H][C@]12CN([C@@H](C)[C@@]1([H])C(=O)N(C)c1ccncc21)S(=O)(=O)c1ccc2OCOc2c1
InChI Key InChIKey=MXNQASHPCAMJHG-UCMVZMLTSA-N
Data  3 IC50  1 Kd  9 EC50
PDB links: 4 PDB IDs match this monomer.
  Tab Delimited (TSV)   2D SDfile   Computed 3D by Vconf -m prep SDfile
Find this compound or compounds like it in BindingDB:
Activity Spreadsheet -- Enzyme Inhibition Constant Data from BindingDB
Found 13 hits for monomerid = 50229715
TargetGlycine receptor subunit alpha-3(Homo sapiens (Human))
Amgen
Curated by ChEMBL
LigandPNGBDBM50229715(CHEMBL4070615)
Affinity DataEC50:  50nM. Assay description: Positive allosteric modulation of human glycine alpha3 receptor expressed in HEK293T cells assessed as potentiation of glycine-induced increase in ch...
TargetGlycine receptor subunit alpha-3(Homo sapiens (Human))
Amgen
Curated by ChEMBL
LigandPNGBDBM50229715(CHEMBL4070615)
Affinity DataKd:  11nM. Assay description: Binding affinity to human glycine alpha3 receptor expressed in HEK293T cells by SPR assay
Target5-hydroxytryptamine receptor 3A(Homo sapiens (Human))
Amgen
Curated by ChEMBL
LigandPNGBDBM50229715(CHEMBL4070615)
Affinity DataIC50: >3.00E+4nM. Assay description: Inhibition of 5-HT3 receptor (unknown origin)
In DepthDetails ArticlePubMed
TargetGlycine receptor subunit alpha-1/beta(Homo sapiens (Human))
Amgen
Curated by ChEMBL
LigandPNGBDBM50229715(CHEMBL4070615)
Affinity DataEC50:  16nM. Assay description: Positive allosteric modulation of human glycine alpha1beta receptor expressed in HEK293T cells assessed as glycine-induced increase in current respon...
TargetNeuronal acetylcholine receptor subunit alpha-4/beta-2(Homo sapiens (Human))
Amgen
Curated by ChEMBL
LigandPNGBDBM50229715(CHEMBL4070615)
Affinity DataEC50: >2.50E+4nM. Assay description: Agonist activity at alpha4beta2 nAChR (unknown origin)
In DepthDetails ArticlePubMed
TargetNeuronal acetylcholine receptor subunit alpha-4/beta-2(Homo sapiens (Human))
Amgen
Curated by ChEMBL
LigandPNGBDBM50229715(CHEMBL4070615)
Affinity DataIC50: >2.50E+4nM. Assay description: Inhibition of alpha4beta2 nAChR (unknown origin)
In DepthDetails ArticlePubMed
TargetGamma-aminobutyric acid receptor subunit gamma-2(Mus musculus)
Amgen
Curated by ChEMBL
LigandPNGBDBM50229715(CHEMBL4070615)
Affinity DataEC50: >5.00E+4nM. Assay description: Positive allosteric modulation of C57BL/6 mouse GABAA receptor alpha1beta2gamma2 assessed as increase in GABA-induced current response at -60 mV hold...
In DepthDetails ArticlePubMed
LigandPNGBDBM50229715(CHEMBL4070615)
Affinity DataIC50: >3.00E+4nM. Assay description: Inhibition of C57BL/6 mouse GABAA receptor alpha1beta3gamma2
In DepthDetails ArticlePubMed
TargetGlycine receptor subunit beta(Homo sapiens (Human))
Amgen
Curated by ChEMBL
LigandPNGBDBM50229715(CHEMBL4070615)
Affinity DataEC50:  66nM. Assay description: Positive allosteric modulation of human glycine alpha3beta receptor expressed in HEK293T cells assessed as glycine-induced increase in current respon...
In DepthDetails ArticlePubMed
LigandPNGBDBM50229715(CHEMBL4070615)
Affinity DataEC50: >3.00E+4nM. Assay description: Positive allosteric modulation of C57BL/6 mouse GABAA receptor alpha1beta3gamma2 assessed as increase in GABA-induced current response at -60 mV hold...
In DepthDetails ArticlePubMed
TargetGlycine receptor subunit alpha-1(Homo sapiens (Human))
Amgen
Curated by ChEMBL
LigandPNGBDBM50229715(CHEMBL4070615)
Affinity DataEC50:  32nM. Assay description: Positive allosteric modulation of human glycine alpha1 receptor expressed in HEK293T cells assessed as glycine-induced increase incurrent response af...
TargetGlycine receptor subunit alpha-3(Homo sapiens (Human))
Amgen
Curated by ChEMBL
LigandPNGBDBM50229715(CHEMBL4070615)
Affinity DataEC50:  50nM. Assay description: Positive allosteric modulation of human glycine alpha3 receptor expressed in HEK293T cells assessed as glycine-induced increase in current response a...
Target5-hydroxytryptamine receptor 3A(Homo sapiens (Human))
Amgen
Curated by ChEMBL
LigandPNGBDBM50229715(CHEMBL4070615)
Affinity DataEC50: >2.50E+4nM. Assay description: Agonist activity at 5-HT3 receptor (unknown origin)
In DepthDetails ArticlePubMed