BDBM50229733 CHEMBL4092261
SMILES CC(C)C[C@@H]1NC(=O)[C@H](CCC(N)=O)NC(=O)[C@H](CCCNC(N)=N)NC(=O)[C@@H]2CSCCC(=O)N3CN(CN(C3)C(=O)CCSC[C@H](NC(=O)[C@H](C)N)C(=O)N[C@@H](Cc3ccccc3)C(=O)N[C@@H](CCCNC(N)=N)C(=O)N[C@@H](CC(C)C)C(=O)N3CCC[C@H]3C(=O)N2)C(=O)CCSC[C@H](NC(=O)[C@H](CCCNC(N)=N)NC1=O)C(=O)N[C@@H](CCCNC(N)=N)C(O)=O
InChI Key InChIKey=SDPOWUXBUPSFJD-ZFTOESBASA-N
Data  1 KI
  Tab Delimited (TSV)   2D SDfile   Computed 3D by Vconf -m prep SDfile
Find this compound or compounds like it in BindingDB:
Activity Spreadsheet -- Enzyme Inhibition Constant Data from BindingDB
Found 1 hit for monomerid = 50229733
TargetCoagulation factor XII(Homo sapiens (Human))
Ecole Polytechnique F�D�Rale De Lausanne (Epfl)
Curated by ChEMBL
LigandPNGBDBM50229733(CHEMBL4092261)
Affinity DataKi:  59nM. Assay description: Inhibition of human beta factor 12a using fluorogenic substrate Boc-Gln-Gly-Arg-AMC preincubated for 10 mins followed by addition of substrate measur...
In DepthDetails ArticlePubMed