BDBM50229795 CHEMBL92169
SMILES Oc1nc2cc3cc(OCCCC(=O)N4CCC(CC4)N4CCCCC4)ccc3[nH]c2n1
InChI Key InChIKey=VESLONFNRNANOV-UHFFFAOYSA-N
Data  1 IC50
  Tab Delimited (TSV)   2D SDfile   Computed 3D by Vconf -m prep SDfile
Find this compound or compounds like it in BindingDB:
Activity Spreadsheet -- Enzyme Inhibition Constant Data from BindingDB
Found 1 hit for monomerid = 50229795
TargetcGMP-inhibited 3',5'-cyclic phosphodiesterase 3A/3B(Homo sapiens (Human))
Bristol-Myers Squibb Pharmaceutical Research Institute
Curated by ChEMBL
LigandPNGBDBM50229795(CHEMBL92169)
Affinity DataIC50:  5nM. Assay description: Inhibition of human platelet c-AMP phosphodiesterase PDE 3
In DepthDetails ArticlePubMed