BDBM50229832 CHEMBL91720
SMILES CCN(CC)c1ccc2[nH]c3nc(O)nc3cc2c1
InChI Key InChIKey=KKCILUSBJOPNRG-UHFFFAOYSA-N
Data  1 IC50
  Tab Delimited (TSV)   2D SDfile   Computed 3D by Vconf -m prep SDfile
Find this compound or compounds like it in BindingDB:
Activity Spreadsheet -- Enzyme Inhibition Constant Data from BindingDB
Found 1 hit for monomerid = 50229832
TargetcGMP-inhibited 3',5'-cyclic phosphodiesterase 3A/3B(Homo sapiens (Human))
Bristol-Myers Squibb Pharmaceutical Research Institute
Curated by ChEMBL
LigandPNGBDBM50229832(CHEMBL91720)
Affinity DataIC50:  70nM. Assay description: Inhibition of human platelet cAMP phosphodiesterase PDE 3
In DepthDetails ArticlePubMed