BDBM50229860 CHEMBL101143
SMILES Oc1[nH]c(Nc2ccc(Cl)cc2)nc2ncnc12
InChI Key InChIKey=AUUBSEVTDIKILH-UHFFFAOYSA-N
Data  2 IC50
  Tab Delimited (TSV)   2D SDfile   Computed 3D by Vconf -m prep SDfile
Find this compound or compounds like it in BindingDB:
Activity Spreadsheet -- Enzyme Inhibition Constant Data from BindingDB
Found 2 hits for monomerid = 50229860
TargetThymidine kinase(Human herpesvirus 1 (strain SC16) (HHV-1) (Human h...)
University Of Massachusetts Medical School
Curated by ChEMBL
LigandPNGBDBM50229860(CHEMBL101143)
Affinity DataIC50:  1.00E+5nM. Assay description: Inhibitory activity against HSV-1 thymidine kinase isolated from HeLa cells
In DepthDetails ArticlePubMed
TargetThymidine kinase(Human herpesvirus 2)
University Of Massachusetts Medical School
Curated by ChEMBL
LigandPNGBDBM50229860(CHEMBL101143)
Affinity DataIC50:  5.01E+4nM. Assay description: Inhibitory activity against HSV-2 thymidine kinase isolated from HeLa cells
In DepthDetails ArticlePubMed