BDBM50229862 CHEMBL101020
SMILES Oc1[nH]c(Nc2cccc(CCl)c2)nc2ncnc12
InChI Key InChIKey=ZSUCVWIKTOESCJ-UHFFFAOYSA-N
Data  2 IC50
  Tab Delimited (TSV)   2D SDfile   Computed 3D by Vconf -m prep SDfile
Find this compound or compounds like it in BindingDB:
Activity Spreadsheet -- Enzyme Inhibition Constant Data from BindingDB
Found 2 hits for monomerid = 50229862
TargetThymidine kinase(Human herpesvirus 1 (strain SC16) (HHV-1) (Human h...)
University Of Massachusetts Medical School
Curated by ChEMBL
LigandPNGBDBM50229862(CHEMBL101020)
Affinity DataIC50:  1.41E+3nM. Assay description: Inhibitory activity against HSV-1 thymidine kinase isolated from HeLa cells
In DepthDetails ArticlePubMed
TargetThymidine kinase(Human herpesvirus 2)
University Of Massachusetts Medical School
Curated by ChEMBL
LigandPNGBDBM50229862(CHEMBL101020)
Affinity DataIC50:  1.35E+3nM. Assay description: Inhibitory activity against HSV-2 thymidine kinase isolated from HeLa cells
In DepthDetails ArticlePubMed