BDBM50229937 CHEMBL280991
SMILES Cc1c(C(=O)c2ccccc2F)c2cccc3OCC(CN4CCOCC4)n1c23
InChI Key InChIKey=PEWDBMDNBJCPSY-UHFFFAOYSA-N
Data  1 IC50
  Tab Delimited (TSV)   2D SDfile   Computed 3D by Vconf -m prep SDfile
Find this compound or compounds like it in BindingDB:
Activity Spreadsheet -- Enzyme Inhibition Constant Data from BindingDB
Found 1 hit for monomerid = 50229937
TargetCannabinoid receptor 1/2(Rattus norvegicus (Rat))
Sterling Research Group
Curated by ChEMBL
LigandPNGBDBM50229937(CHEMBL280991)
Affinity DataIC50:  1.43E+3nM. Assay description: Concentration required to displace 50% of 0.5 nM [3H](aminoalkyl)indole binding to cannabinoid receptor in rat cerebellum membranes
In DepthDetails ArticlePubMed