BDBM50230075 CHEMBL126379
SMILES COC(=O)COc1cccc(\C=C\c2ccc3ccccc3n2)c1
InChI Key InChIKey=ZDJMZZUUHCSCKL-PKNBQFBNSA-N
Data  1 IC50
  Tab Delimited (TSV)   2D SDfile   Computed 3D by Vconf -m prep SDfile
Find this compound or compounds like it in BindingDB:
Activity Spreadsheet -- Enzyme Inhibition Constant Data from BindingDB
Found 1 hit for monomerid = 50230075
TargetCysteinyl leukotriene receptor 1/2(Homo sapiens (Human))
Merck Frosst Centre For Therapeutic Research
Curated by ChEMBL
LigandPNGBDBM50230075(CHEMBL126379)
Affinity DataIC50:  1.00E+3nM. Assay description: Inhibition of human carbonic anhydrase II
In DepthDetails ArticlePubMed