BDBM50230095 CHEMBL405525
SMILES CCCC\C(=C/c1cnc(CCCC)n1Cc1ccccc1Cl)C(O)=O
InChI Key InChIKey=QGXHHPALYOKVTB-DTQAZKPQSA-N
Data  1 IC50
  Tab Delimited (TSV)   2D SDfile   Computed 3D by Vconf -m prep SDfile
Find this compound or compounds like it in BindingDB:
Activity Spreadsheet -- Enzyme Inhibition Constant Data from BindingDB
Found 1 hit for monomerid = 50230095
LigandPNGBDBM50230095(CHEMBL405525)
Affinity DataIC50:  6.90E+3nM. Assay description: Inhibition of [125I]angiotensin II specific binding to rat mesenteric arteries
In DepthDetails ArticlePubMed