BDBM50230128 CHEMBL437798
SMILES CCNC(=O)[C@H]1CCCN1C(=O)[C@H](CCCN=C(N)N)NC(=O)[C@H](CC(C)C)NC(=O)[C@@H](Cc1c[nH]c2ccccc12)NC(=O)[C@H](Cc1ccc(O)cc1)NC(=O)[C@H](CO)N(C)C(=O)[C@H](Cc1c[nH]c2ccccc12)NC(=O)[C@H](Cc1c[nH]cn1)NC(=O)CN(C)C(C)=O
InChI Key InChIKey=KHNNKWMJCIVLTO-YEQCJUASSA-N
Data  1 KI
  Tab Delimited (TSV)   2D SDfile   Computed 3D by Vconf -m prep SDfile
Find this compound or compounds like it in BindingDB:
Activity Spreadsheet -- Enzyme Inhibition Constant Data from BindingDB
Found 1 hit for monomerid = 50230128
TargetLutropin-choriogonadotropic hormone receptor(Rattus norvegicus)
Abbott Laboratories
Curated by ChEMBL
LigandPNGBDBM50230128(CHEMBL437798)
Affinity DataKi:  0.380nM. Assay description: Negative logarithm of equilibrium dissociation constant in the rat pituitary luteinizing releasing hormone receptor binding assay
In DepthDetails ArticlePubMed