BDBM50230157 CHEMBL3144232
SMILES OC(=O)C(F)(F)F.O[C@@H]1[C@H](CC2CCCCC2)NC(=O)[C@H](COC(=O)CCC[C@H](CN2CCOCC2)OC1=O)NC(=O)[C@H](Cc1ccccc1)NC(=O)[C@@H]1CCCN1
InChI Key InChIKey=UHLIJRPIQFPDBT-XTCYHELBSA-N
Data  1 IC50
  Tab Delimited (TSV)   2D SDfile   Computed 3D by Vconf -m prep SDfile
Find this compound or compounds like it in BindingDB:
Activity Spreadsheet -- Enzyme Inhibition Constant Data from BindingDB
Found 1 hit for monomerid = 50230157
TargetRenin(Homo sapiens (Human))
Merck Research Laboratories
Curated by ChEMBL
LigandPNGBDBM50230157(CHEMBL3144232)
Affinity DataIC50:  1.70nMpH: 7.4Assay Description:Inhibitory activity against human renin inhibition (at pH 7.4)
In DepthDetails ArticlePubMed