BDBM50230230 CHEMBL422303
SMILES Oc1ccc2cnccc2n1
InChI Key InChIKey=ZQKMVHXJWJNEQG-UHFFFAOYSA-N
Data  1 IC50
  Tab Delimited (TSV)   2D SDfile   Computed 3D by Vconf -m prep SDfile
Find this compound or compounds like it in BindingDB:
Activity Spreadsheet -- Enzyme Inhibition Constant Data from BindingDB
Found 1 hit for monomerid = 50230230
TargetcGMP-inhibited 3',5'-cyclic phosphodiesterase 3A/3B(Homo sapiens (Human))
Sterling Winthrop Pharmaceuticals Research Division
Curated by ChEMBL
LigandPNGBDBM50230230(CHEMBL422303)
Affinity DataIC50:  1.88E+4nM. Assay description: In vitro inhibitory activity against cAMP PDE III.
In DepthDetails ArticlePubMed