BDBM50230298 CHEMBL4063221
SMILES Cl.Cl.OC(=O)CCc1ccc(OCc2ccc(CN3CCC4(CC3)CC(CCOc3cnccn3)CCO4)cc2)cc1
InChI Key InChIKey=ODEQNOBYSQFDII-UHFFFAOYSA-N
Data  1 EC50
  Tab Delimited (TSV)   2D SDfile   Computed 3D by Vconf -m prep SDfile
Find this compound or compounds like it in BindingDB:
Activity Spreadsheet -- Enzyme Inhibition Constant Data from BindingDB
Found 1 hit for monomerid = 50230298
TargetFree fatty acid receptor 1(Homo sapiens (Human))
Saint Petersburg State University
Curated by ChEMBL
LigandPNGBDBM50230298(CHEMBL4063221)
Affinity DataEC50:  1.48E+3nM. Assay description: Agonist activity at human GPR40 expressed in CHO cells assessed as increase in intracellular calcium flux by Fluo-8 dye based FLIPR assay
In DepthDetails ArticlePubMed