BDBM50230306 CHEMBL4073421
SMILES OC(=O)CCc1ccc(OCc2ccc(CN3CCC4(CC3)CC(CCO4)Oc3ccccn3)cc2)cc1
InChI Key InChIKey=DEYQONOAYIGYQY-UHFFFAOYSA-N
Data  1 EC50
  Tab Delimited (TSV)   2D SDfile   Computed 3D by Vconf -m prep SDfile
Find this compound or compounds like it in BindingDB:
Activity Spreadsheet -- Enzyme Inhibition Constant Data from BindingDB
Found 1 hit for monomerid = 50230306
TargetFree fatty acid receptor 1(Homo sapiens (Human))
Saint Petersburg State University
Curated by ChEMBL
LigandPNGBDBM50230306(CHEMBL4073421)
Affinity DataEC50:  900nM. Assay description: Agonist activity at human GPR40 expressed in CHO cells assessed as increase in intracellular calcium flux by Fluo-8 dye based FLIPR assay
In DepthDetails ArticlePubMed