BDBM50230319 CHEMBL4060213
SMILES CCCCNc1nc(SC)nc2n(Cc3ccc(F)cc3)ccc12
InChI Key InChIKey=FQVMTUKCTPYSEC-UHFFFAOYSA-N
Data  1 KI
  Tab Delimited (TSV)   2D SDfile   Computed 3D by Vconf -m prep SDfile
Find this compound or compounds like it in BindingDB:
Activity Spreadsheet -- Enzyme Inhibition Constant Data from BindingDB
Found 1 hit for monomerid = 50230319
TargetProto-oncogene tyrosine-protein kinase Src(Homo sapiens (Human))
Universit£
Curated by ChEMBL
LigandPNGBDBM50230319(CHEMBL4060213)
Affinity DataKi:  3.00E+3nM. Assay description: Inhibition of human recombinant full length N-terminal His6-tagged Src expressed in Sf21 cells using KVEKIGEGTYGVVYK as substrate after 10 mins in pr...
In DepthDetails ArticlePubMed