BDBM50230337 CHEMBL343109
SMILES [O-][S+](Cc1cc(OC(F)F)ccn1)c1nc2cscc2[nH]1
InChI Key InChIKey=FDWNXPPWABHLFK-UHFFFAOYSA-N
Data  1 IC50
  Tab Delimited (TSV)   2D SDfile   Computed 3D by Vconf -m prep SDfile
Find this compound or compounds like it in BindingDB:
Activity Spreadsheet -- Enzyme Inhibition Constant Data from BindingDB
Found 1 hit for monomerid = 50230337
TargetPotassium-transporting ATPase alpha chain 1(Sus scrofa (Pig))
Hoechst
Curated by ChEMBL
LigandPNGBDBM50230337(CHEMBL343109)
Affinity DataIC50:  500nM. Assay description: In vitro inhibitory concentration against H+/K+ ATPase from pig stomach by probit analysis
In DepthDetails ArticlePubMed