BDBM50230657 CHEMBL290493
SMILES CCCC(=O)NCCc1cccc2ccc(OC)cc12
InChI Key InChIKey=OLBZALDKGALNQC-UHFFFAOYSA-N
Data  1 KI  1 IC50  1 Kd
  Tab Delimited (TSV)   2D SDfile   Computed 3D by Vconf -m prep SDfile
Find this compound or compounds like it in BindingDB:
Activity Spreadsheet -- Enzyme Inhibition Constant Data from BindingDB
Found 3 hits for monomerid = 50230657
TargetMelatonin receptor type 1C(Gallus gallus)
Universit£
Curated by ChEMBL
LigandPNGBDBM50230657(CHEMBL290493)
Affinity DataKi:  0.0295nM. Assay description: Binding affinity against chicken brain melatonin receptors using 2-[125I]iodomelatonin as radioligand
In DepthDetails ArticlePubMed
TargetMelatonin receptor type 1A/1B(Homo sapiens (Human))
Institut De Chimie Pharmaceutique
Curated by ChEMBL
LigandPNGBDBM50230657(CHEMBL290493)
Affinity DataKd:  0.00615nM. Assay description: Binding affinity to melatonin receptor measured on ovine pars tuberalis membrane
In DepthDetails ArticlePubMed
TargetMelatonin receptor type 1A/1B(Homo sapiens (Human))
Institut De Chimie Pharmaceutique
Curated by ChEMBL
LigandPNGBDBM50230657(CHEMBL290493)
Affinity DataIC50:  0.00345nM. Assay description: Monophasic inhibitory concentration against melatonin receptor was measured on ovine pars tuberalis membrane.
In DepthDetails ArticlePubMed