BDBM50230836 CHEMBL411723
SMILES OC(=O)c1cn(-c2ccc(F)cc2F)c2nc(C3=CCNCC3)c(F)cc2c1=O
InChI Key InChIKey=IUVUYVQDAZXHCH-UHFFFAOYSA-N
Data  1 IC50
  Tab Delimited (TSV)   2D SDfile   Computed 3D by Vconf -m prep SDfile
Find this compound or compounds like it in BindingDB:
Activity Spreadsheet -- Enzyme Inhibition Constant Data from BindingDB
Found 1 hit for monomerid = 50230836
TargetDNA gyrase subunit A/B(Escherichia coli (strain K12))
Warner-Lambert
Curated by ChEMBL
LigandPNGBDBM50230836(CHEMBL411723)
Affinity DataIC50:  1.24E+4nM. Assay description: Inhibition of the gyrase mediated cleavage of supercoiled DNA
In DepthDetails ArticlePubMed