BDBM50230984 CHEMBL4099832
SMILES OC(=O)C(F)(F)F.OC(=O)C(F)(F)F.CCCCC1N(C(N)=NC1=O)c1nc(NC(N)=N)nc(Nc2ccc(Nc3nc(NC(N)=N)nc(n3)N3C(CCCC)C(=O)N=C3N)cc2)n1
InChI Key InChIKey=OTIMERILYXPPHI-UHFFFAOYSA-N
Data  2 EC50
  Tab Delimited (TSV)   2D SDfile   Computed 3D by Vconf -m prep SDfile
Find this compound or compounds like it in BindingDB:
Activity Spreadsheet -- Enzyme Inhibition Constant Data from BindingDB
Found 2 hits for monomerid = 50230984
TargetAtrial natriuretic peptide receptor 1(Rattus norvegicus)
Asubio Pharma
Curated by ChEMBL
LigandPNGBDBM50230984(CHEMBL4099832)
Affinity DataEC50:  23nM. Assay description: Agonist activity at rat NPR-A expressed in CHO cells assessed as increase in cGMP accumulation after 15 mins by fluorescent assay
In DepthDetails ArticlePubMed
TargetAtrial natriuretic peptide receptor 1(Homo sapiens (Human))
Asubio Pharma
Curated by ChEMBL
LigandPNGBDBM50230984(CHEMBL4099832)
Affinity DataEC50:  2nM. Assay description: Agonist activity at human NPR-A expressed in CHO cells assessed as increase in cGMP accumulation after 30 mins by radioimmunoassay
In DepthDetails ArticlePubMed